{"text_format":"1","workbook":"xlsx","n_sheets":6,"sheets":["Hinweise","Grundbuch","Hauptbuch","GuV","Bilanzbuch","Kontenplan"],"not_rendered":{"charts":0,"images":18,"macros":1,"external_links":1,"defined_names":0,"comments":0,"pivot_tables":0},"unopened":[],"bounds":{"document_bytes":16777216,"sheet_cells":100000,"rows_first":2000,"rows_last":500,"rows_between":2000,"halvings":0,"cell_chars":16384,"cell_head_chars":4096},"cells_cut":0,"cells_raw":0,"read":"whole","date_system":"1900"}

{"sheet":"Hinweise","index":0,"n_rows":68,"n_cols":7,"rows_kept":68,"cut":false,"hidden":false,"merged":[[58,1,58,3],[59,1,59,3],[0,0,0,7],[2,0,2,1],[8,4,10,7],[57,1,57,3]]}
["Geschäftsgang 7"]
[]
["Voraussetzungen"]
["Um den Geschäftsgang buchen zu können müssen Sie Kenntnisse über die folgenden Lehrninhalte haben:"]
["Buchungen auf Bestandskonten"]
["Buchungen auf Erfolgskonten"]
["Bestandsveränderungen"]
["Umsatzsteuer"]
["Buchung von Bezugskosten",null,null,null,"Für den Kontenabschluss müssen Sie Grundkenntnisse in der                  Tabellenkalkulation haben! "]
["Kontenabschluss im Hauptbuch"]
[]
[]
["Buchen im Grundbuch"]
["1. Wählen Sie die Tabelle \"Grundbuch\"."]
[]
["2. Buchen Sie die Geschäftsvorfälle"]
["    entweder durch Direkteingabe in die entsprechenden Felder des Grundbuchs (Kontennummern und Beträge)"]
["    oder durch Aufruf von Buchungsfenstern. (Klicken Sie dazu jeweils auf die Schaltfläche \"Buchung\" und beenden"]
["    Sie die Eingabe  mit \"OK\".)"]
["    Die Kontennummern sind vierstellig anzugeben. (siehe Kontenplan). Bei zusammengesetzten Buchungssätzen"]
["    sind die Buchungen nach der Höhe der Beträge geordnet vorzunehmen. "]
[]
["3. Sie können sich den Kontenplan mit Kontennummern jederzeit durch Klick auf den"]
["    entsprechenden Button anzeigen lassen."]
[]
["4. Die Richtigkeit Ihrer Buchungen wird bestätigt oder Sie werden auf"]
["    Fehler hingewiesen. (Ohne Buchung werden Fehler angezeigt.)"]
[]
["Buchen in Hauptbuch, GuV und Schlussbilanz"]
["1. Navigation"]
["    Sie können über die Blattregisterkarten die Tabellen Grundbuch, Hauptbuch, GuV und Bilanzbuch ansteuern."]
["    Einen direkten Zugriff auf die jeweils benötigen Konten haben Sie über die folgenden Schalter:"]
[null,"Hauptbuchkonten",null,null,"Grundbuch"]
[null,"Gewinn und Verlust",null,null,"Schlussbilanz"]
[null,"Bestandsveränderungen",null,null,"Umsatzsteuer"]
[null,"Vorsteuer",null,null,"Unfertige Erzeugnisse"]
[null,"Fertige Erzeugnisse"]
["   Über diese Schalter können Sie aus dem Grundbuch heraus, das für die jeweilige Buchung benötigte Konto"]
["   direkt aufrufen. Dieses Konto wird dann jeweils mit einem X markiert."]
[]
["2. Buchungen"]
["    Die Systematik wird Ihnen an einem Screenshot das Kontos Forderungen gezeigt."]
[]
["    lfd. Nummern ",null,null,null,"lfd. Nummern",null,"               Navigation"]
[]
[]
[]
[]
[]
[]
[]
[]
[]
[null,null,null,null,"Beträge"]
[]
[null,"Kontenanruf (in jeder Zelle steht eine Kontonummer)",null,null,null,null,"   Abschlussmeldung"]
[]
[null,"Eröffnungsbuchungen (bereits gebucht)",null,null,null,"A   = Abschlussbuchung"]
[null,"laufende Buchungen",null,null,null,"AB = Anfangsbestand"]
[null,"Abschlussbuchungen und Berechnungen",null,null,null,"SB = Schlussbestand"]
{"$rows_left_out":9}
{"sheet":"Grundbuch","index":1,"n_rows":100,"n_cols":7,"rows_kept":100,"cut":false,"hidden":false,"merged":[[14,5,14,6],[99,0,99,6],[1,0,1,4],[2,0,2,4],[91,0,91,2],[93,5,93,6],[94,5,94,6],[96,0,97,0],[92,5,92,6],[5,1,7,2],[5,5,5,6],[6,5,6,6],[7,5,7,6],[9,0,10,0],[12,5,12,6],[13,5,13,6],[16,0,17,0],[19,5,19,6],[20,5,20,6],[21,5,21,6],[23,0,24,0],[23,1,24,1],[23,2,24,2],[23,3,24,3],[23,4,24,4],[23,5,24,5],[23,6,24,6],[19,1,21,3],[28,5,28,6],[33,5,34,6],[35,5,35,6],[36,5,36,6],[38,0,40,0],[30,0,31,0],[26,1,28,2],[26,5,26,6],[27,5,27,6],[42,1,44,3],[42,5,42,6],[43,5,43,6],[44,5,44,6],[60,0,61,0],[50,5,50,6],[51,5,51,6],[46,0,47,0],[46,1,47,1],[46,2,47,2],[46,3,47,3],[46,4,47,4],[46,5,47,5],[46,6,47,6],[49,5,49,6],[53,0,54,0],[56,1,58,2],[56,5,56,6],[57,5,57,6],[58,5,58,6],[63,5,63,6],[64,5,64,6],[65,5,65,6],[67,0,68,0],[70,1,72,3],[70,5,70,6],[71,5,71,6],[72,5,72,6],[74,0,75,0],[74,1,75,1],[74,2,75,2],[74,3,75,3],[74,4,75,4],[88,0,89,0],[81,0,82,0],[84,1,86,2],[84,5,84,6],[85,5,85,6],[86,5,86,6],[74,6,75,6],[77,1,79,2],[77,5,77,6],[78,5,78,6],[79,5,79,6],[74,5,75,5]]}
[]
["Geschäftsvorfälle"]
["Grundbuch"]
[null,null,null,null,null,null,0.19]
[]
["1.","Für eine Pkw-Reparatur zahlen wir bar,",null,"netto",null,{"$f":"IF(AND(B10=\"6160\",B11=\"2600\",E10=\"2880\"),\"Die Konten sind richtig!\",\"Mindestens ein Konto ist falsch!\")","v":"Mindestens ein Konto ist falsch!"}]
["Geschäftsvorfall",null,null,"USt.",null,{"$f":"IF(AND(D10=350,D11=66.5,G10=E8),\"Die Beträge sind richtig!\",\"Mindestens ein Betrag ist falsch!\")","v":"Mindestens ein Betrag ist falsch!"}]
[null,null,null,"brutto",416.5,{"$f":"IF(AND(F6=\"Die Konten sind richtig!\",F7=\"Die Beträge sind richtig!\"),\"Alles richtig!\",\"Es sind noch Fehler vorhanden!\")","v":"Es sind noch Fehler vorhanden!"}]
[null,"Soll","Konto","€","Haben","Konto","€"]
["Buchungssatz",null,{"$f":"IF(B10=\"\",\"\",VLOOKUP(B10,Kontenplan!$A$4:$B$34,2))","v":""},null,null,{"$f":"IF(E10=\"\",\"\",VLOOKUP(E10,Kontenplan!$A$4:$B$34,2))","v":""}]
[null,null,{"$f":"IF(B11=\"\",\"\",VLOOKUP(B11,Kontenplan!$A$4:$B$34,2))","v":""}]
[]
["2.","Zieleinkauf von Schreibtischen, ",null,"netto",11200,{"$f":"IF(AND(B17=\"0800\",B18=\"2600\",E17=\"4400\"),\"Die Konten sind richtig!\",\"Mindestens ein Konto ist falsch!\")","v":"Mindestens ein Konto ist falsch!"}]
["Geschäftsvorfall",null,null,"USt.",null,{"$f":"IF(AND(D17=11200,D18=2128,G17=13328),\"Die Beträge sind richtig!\",\"Mindestens ein Betrag ist falsch!\")","v":"Mindestens ein Betrag ist falsch!"}]
[null,null,null,"brutto",null,{"$f":"IF(AND(F13=\"Die Konten sind richtig!\",F14=\"Die Beträge sind richtig!\"),\"Alles richtig!\",\"Es sind noch Fehler vorhanden!\")","v":"Es sind noch Fehler vorhanden!"}]
[null,"Soll","Konto","€","Haben","Konto","€"]
["Buchungssatz","",{"$f":"IF(B17=\"\",\"\",VLOOKUP(B17,Kontenplan!$A$4:$B$34,2))","v":""},null,"",{"$f":"IF(E17=\"\",\"\",VLOOKUP(E17,Kontenplan!$A$4:$B$34,2))","v":""}]
[null,"",{"$f":"IF(B18=\"\",\"\",VLOOKUP(B18,Kontenplan!$A$4:$B$34,2))","v":""}]
[]
["3.","Die Baumwollweberei Kaiser OHG belastet uns mit Verzugszinsen,",null,null,120,{"$f":"IF(AND(B24=\"7510\",E24=\"4400\"),\"Die Konten sind richtig!\",\"Mindestens ein Konto ist falsch!\")","v":"Mindestens ein Konto ist falsch!"}]
["Geschäftsvorfall",null,null,null,null,{"$f":"IF(AND(D24=E20,G24=E20),\"Die Beträge sind richtig!\",\"Mindestens ein Betrag ist falsch!\")","v":"Mindestens ein Betrag ist falsch!"}]
[null,null,null,null,null,{"$f":"IF(AND(F20=\"Die Konten sind richtig!\",F21=\"Die Beträge sind richtig!\"),\"Alles richtig!\",\"Es sind noch Fehler vorhanden!\")","v":"Es sind noch Fehler vorhanden!"}]
[null,"Soll","Konto","€","Haben","Konto","€"]
["Buchungssatz","",{"$f":"IF(B24=\"\",\"\",VLOOKUP(B24,Kontenplan!$A$4:$B$34,2))","v":""},null,"",{"$f":"IF(E24=\"\",\"\",VLOOKUP(E24,Kontenplan!$A$4:$B$34,2))","v":""}]
[]
[]
["4.","Zieleinkauf von Baumwollstoffen bei der Weberei Holzmann KG,",null,"netto",null,{"$f":"IF(AND(B31=\"2000\",B32=\"2600\",E31=\"4400\"),\"Die Konten sind richtig!\",\"Mindestens ein Konto ist falsch!\")","v":"Mindestens ein Konto ist falsch!"}]
["Geschäftsvorfall",null,null,"USt.",3686,{"$f":"IF(AND(D31=19400,D32=E28,G31=23086),\"Die Beträge sind richtig!\",\"Mindestens ein Betrag ist falsch!\")","v":"Mindestens ein Betrag ist falsch!"}]
[null,null,null,"brutto",null,{"$f":"IF(AND(F27=\"Die Konten sind richtig!\",F28=\"Die Beträge sind richtig!\"),\"Alles richtig!\",\"Es sind noch Fehler vorhanden!\")","v":"Es sind noch Fehler vorhanden!"}]
[null,"Soll","Konto","€","Haben","Konto","€"]
["Buchungssatz","",{"$f":"IF(B31=\"\",\"\",VLOOKUP(B31,Kontenplan!$A$4:$B$34,2))","v":""},null,"",{"$f":"IF(E31=\"\",\"\",VLOOKUP(E31,Kontenplan!$A$4:$B$34,2))","v":""}]
[null,"",{"$f":"IF(B32=\"\",\"\",VLOOKUP(B32,Kontenplan!$A$4:$B$34,2))","v":""}]
[]
["5.","Verbrauch lt. Materialentnahmescheine für",null,null,null,{"$f":"IF(AND(B39=\"6000\",E39=\"2000\",B40=\"6020\",E40=\"2020\",B41=\"6030\",E41=\"2030\"),\"Die Konten sind richtig!\",\"Mindestens ein Konto ist falsch!\")","v":"Mindestens ein Konto ist falsch!"}]
["Geschäftsvorfall",null,"           - Baumwolle",null,7900]
[null,null,"           - Reißverschlüsse",null,250,{"$f":"IF(AND(D39=E35,D40=E36,D41=E37,G39=E35,G40=E36,G41=E37),\"Die Beträge sind richtig!\",\"Mindestens ein Betrag ist falsch!\")","v":"Mindestens ein Betrag ist falsch!"}]
[null,null,"           - Schmierstoffe",null,180,{"$f":"IF(AND(F34=\"Die Konten sind richtig!\",F36=\"Die Beträge sind richtig!\"),\"Alles richtig!\",\"Es sind noch Fehler vorhanden!\")","v":"Es sind noch Fehler vorhanden!"}]
[null,"Soll","Konto","€","Haben","Konto","€"]
["Buchungssatz","",{"$f":"IF(B39=\"\",\"\",VLOOKUP(B39,Kontenplan!$A$4:$B$34,2))","v":""},null,"",{"$f":"IF(E39=\"\",\"\",VLOOKUP(E39,Kontenplan!$A$4:$B$34,2))","v":""}]
[null,"",{"$f":"IF(B40=\"\",\"\",VLOOKUP(B40,Kontenplan!$A$4:$B$34,2))","v":""},null,"",{"$f":"IF(E40=\"\",\"\",VLOOKUP(E40,Kontenplan!$A$4:$B$34,2))","v":""}]
[null,"",{"$f":"IF(B41=\"\",\"\",VLOOKUP(B41,Kontenplan!$A$4:$B$34,2))","v":""},null,"",{"$f":"IF(E41=\"\",\"\",VLOOKUP(E41,Kontenplan!$A$4:$B$34,2))","v":""}]
[]
["6.","Die Black and Blue Jeans GmbH begleicht eine Ausgangsrechnung durch Banküberweisung,",null,null,3800,{"$f":"IF(AND(B47=\"2800\",E47=\"2400\"),\"Die Konten sind richtig!\",\"Mindestens ein Konto ist falsch!\")","v":"Mindestens ein Konto ist falsch!"}]
["Geschäftsvorfall",null,null,null,null,{"$f":"IF(AND(D47=E43,G47=E43),\"Die Beträge sind richtig!\",\"Mindestens ein Betrag ist falsch!\")","v":"Mindestens ein Betrag ist falsch!"}]
[null,null,null,null,null,{"$f":"IF(AND(F43=\"Die Konten sind richtig!\",F44=\"Die Beträge sind richtig!\"),\"Alles richtig!\",\"Es sind noch Fehler vorhanden!\")","v":"Es sind noch Fehler vorhanden!"}]
[null,"Soll","Konto","€","Haben","Konto","€"]
["Buchungssatz","",{"$f":"IF(B47=\"\",\"\",VLOOKUP(B47,Kontenplan!$A$4:$B$34,2))","v":""},null,"",{"$f":"IF(E47=\"\",\"\",VLOOKUP(E47,Kontenplan!$A$4:$B$34,2))","v":""}]
[]
[]
["7.","Banküberweisung für - Löhne",null,null,18500,{"$f":"IF(AND(B54=\"6200\",B55=\"6300\",E54=\"2800\"),\"Die Konten sind richtig!\",\"Mindestens ein Konto ist falsch!\")","v":"Mindestens ein Konto ist falsch!"}]
["Geschäftsvorfall",null,"           - Gehälter",null,28700,{"$f":"IF(AND(D54=E50,D55=E51,G54=E52),\"Die Beträge sind richtig!\",\"Mindestens ein Betrag ist falsch!\")","v":"Mindestens ein Betrag ist falsch!"}]
[null,null,"           - Banklastschrift",null,{"$f":"SUM(E50:E51)","v":47200},{"$f":"IF(AND(F50=\"Die Konten sind richtig!\",F51=\"Die Beträge sind richtig!\"),\"Alles richtig!\",\"Es sind noch Fehler vorhanden!\")","v":"Es sind noch Fehler vorhanden!"}]
[null,"Soll","Konto","€","Haben","Konto","€"]
["Buchungssatz","",{"$f":"IF(B54=\"\",\"\",VLOOKUP(B54,Kontenplan!$A$4:$B$34,2))","v":""},null,"",{"$f":"IF(E54=\"\",\"\",VLOOKUP(E54,Kontenplan!$A$4:$B$34,2))","v":""}]
[null,"",{"$f":"IF(B55=\"\",\"\",VLOOKUP(B55,Kontenplan!$A$4:$B$34,2))","v":""}]
[]
["8.","Verkauf von Partykleidern 26.500,00 € und Rippkleidern 21.200,00 € an einen Textil- großhändler. Zahlung mit Bankscheck,",null,"netto",null,{"$f":"IF(AND(B61=\"2800\",E61=\"5000\",E62=\"4800\"),\"Die Konten sind richtig!\",\"Mindestens ein Konto ist falsch!\")","v":"Mindestens ein Konto ist falsch!"}]
["Geschäftsvorfall",null,null,"USt.",null,{"$f":"IF(AND(D61=E59,G61=47700,G62=9063),\"Die Beträge sind richtig!\",\"Mindestens ein Betrag ist falsch!\")","v":"Mindestens ein Betrag ist falsch!"}]
[null,null,null,"brutto",56763,{"$f":"IF(AND(F57=\"Die Konten sind richtig!\",F58=\"Die Beträge sind richtig!\"),\"Alles richtig!\",\"Es sind noch Fehler vorhanden!\")","v":"Es sind noch Fehler vorhanden!"}]
[null,"Soll","Konto","€","Haben","Konto","€"]
{"$rows_left_out":41}
{"sheet":"Hauptbuch","index":2,"n_rows":173,"n_cols":12,"rows_kept":173,"cut":false,"hidden":false,"merged":[[169,1,169,3],[169,6,169,8],[139,1,139,3],[139,6,139,8],[145,1,145,3],[145,6,145,8],[168,1,168,8],[144,1,144,8],[150,1,150,8],[163,1,163,3],[163,6,163,8],[162,1,162,8],[156,1,156,8],[151,1,151,3],[151,6,151,8],[157,1,157,3],[121,1,121,3],[121,6,121,8],[100,1,100,3],[100,6,100,8],[108,1,108,3],[108,6,108,8],[107,1,107,8],[120,1,120,8],[113,1,113,8],[59,1,59,8],[66,1,66,8],[73,1,73,8],[80,1,80,8],[114,1,114,3],[114,6,114,8],[92,6,92,8],[86,1,86,8],[60,1,60,3],[60,6,60,8],[67,1,67,3],[67,6,67,8],[74,1,74,3],[74,6,74,8],[13,1,13,3],[13,6,13,8],[19,1,19,3],[19,6,19,8],[18,1,18,8],[54,6,54,8],[138,1,138,8],[126,1,126,8],[132,1,132,8],[127,1,127,3],[127,6,127,8],[133,1,133,3],[133,6,133,8],[91,1,91,8],[99,1,99,8],[54,1,54,3],[81,1,81,3],[81,6,81,8],[87,1,87,3],[87,6,87,8],[92,1,92,3],[30,6,30,8],[36,1,36,3],[36,6,36,8],[47,1,47,8],[53,1,53,8],[48,1,48,3],[48,6,48,8],[42,1,42,3],[42,6,42,8],[157,6,157,8],[0,0,0,9],[2,1,2,8],[7,1,7,8],[12,1,12,8],[3,1,3,3],[3,6,3,8],[8,1,8,3],[8,6,8,8],[23,1,23,8],[29,1,29,8],[35,1,35,8],[41,1,41,8],[24,1,24,3],[24,6,24,8],[30,1,30,3]]}
["Hauptbuch"]
[]
["Soll","0510 Grundstücke und Bauten",null,null,null,null,null,null,null,"Haben","X"]
["Nr.","Kontenanruf",null,null,"Euro","Nr.","Kontenanruf",null,null,"Euro"]
["AB","8000",null,null,{"$f":"Bilanzbuch!C4","v":1250000},"SB",null,null,null,null,{"$f":"IF(L5=\"Kontenanrufe vollständig!\",1,2)","v":2},{"$f":"IF(G5=8010,\"Kontenanrufe vollständig!\",\"Kontenanrufe nicht vollständig!\")","v":"Kontenanrufe nicht vollständig!"}]
[null,null,null,null,null,null,null,null,null,null,{"$f":"IF(L6=\"Saldo richtig!\",1,2)","v":2},{"$f":"IF(J5=1250000,\"Saldo richtig!\",\"Ermitteln Sie den richtigen Saldo!\")","v":"Ermitteln Sie den richtigen Saldo!"}]
[]
["Soll","0700 Technische Anlagen und Maschinen",null,null,null,null,null,null,null,"Haben"]
["Nr.","Kontenanruf",null,null,"Euro","Nr.","Kontenanruf",null,null,"Euro"]
["AB","8000",null,null,{"$f":"Bilanzbuch!C5","v":520000},"SB",null,null,null,null,{"$f":"IF(L10=\"Kontenanrufe vollständig!\",1,2)","v":2},{"$f":"IF(G10=8010,\"Kontenanrufe vollständig!\",\"Kontenanrufe nicht vollständig!\")","v":"Kontenanrufe nicht vollständig!"}]
[null,null,null,null,null,null,null,null,null,null,{"$f":"IF(L11=\"Saldo richtig!\",1,2)","v":2},{"$f":"IF(J10=520000,\"Saldo richtig!\",\"Ermitteln Sie den richtigen Saldo!\")","v":"Ermitteln Sie den richtigen Saldo!"}]
[]
["Soll","0800 Betriebs- und Geschäftsausstattung",null,null,null,null,null,null,null,"Haben"]
["Nr.","Kontenanruf",null,null,"Euro","Nr.","Kontenanruf",null,null,"Euro"]
["AB","8000",null,null,{"$f":"Bilanzbuch!C6","v":84000}]
["2.",null,null,null,null,"SB",null,null,null,null,{"$f":"IF(L16=\"Kontenanrufe vollständig!\",1,2)","v":2},{"$f":"IF(AND(B16=4400,G15=2880,G16=8010),\"Kontenanrufe vollständig!\",\"Kontenanrufe nicht vollständig!\")","v":"Kontenanrufe nicht vollständig!"}]
[null,null,null,null,null,null,null,null,null,null,{"$f":"IF(L17=\"Saldo richtig!\",1,2)","v":2},{"$f":"IF(J16=94750,\"Saldo richtig!\",\"Ermitteln Sie den richtigen Saldo!\")","v":"Ermitteln Sie den richtigen Saldo!"}]
[]
["Soll","0840 Fuhrpark",null,null,null,null,null,null,null,"Haben"]
["Nr.","Kontenanruf",null,null,"Euro","Nr.","Kontenanruf",null,null,"Euro"]
["AB","8000",null,null,{"$f":"Bilanzbuch!C7","v":95000},"SB",null,null,null,null,{"$f":"IF(L21=\"Kontenanrufe vollständig!\",1,2)","v":2},{"$f":"IF(G21=8010,\"Kontenanrufe vollständig!\",\"Kontenanrufe nicht vollständig!\")","v":"Kontenanrufe nicht vollständig!"}]
[null,null,null,null,null,null,null,null,null,null,{"$f":"IF(L22=\"Saldo richtig!\",1,2)","v":2},{"$f":"IF(J21=95000,\"Saldo richtig!\",\"Ermitteln Sie den richtigen Saldo!\")","v":"Ermitteln Sie den richtigen Saldo!"}]
[]
["Soll","2000 Rohstoffe",null,null,null,null,null,null,null,"Haben"]
["Nr.","Kontenanruf",null,null,"Euro","Nr.","Kontenanruf",null,null,"Euro"]
["AB","8000",null,null,{"$f":"Bilanzbuch!C8","v":210000}]
[null,null,null,null,null,"SB",null,null,null,null,{"$f":"IF(L27=\"Kontenanrufe vollständig!\",1,2)","v":2},{"$f":"IF(AND(B27=4400,G26=6000,G27=8010),\"Kontenanrufe vollständig!\",\"Kontenanrufe nicht vollständig!\")","v":"Kontenanrufe nicht vollständig!"}]
[null,null,null,null,null,null,null,null,null,null,{"$f":"IF(L28=\"Saldo richtig!\",1,2)","v":2},{"$f":"IF(J27=221500,\"Saldo richtig!\",\"Ermitteln Sie den richtigen Saldo!\")","v":"Ermitteln Sie den richtigen Saldo!"}]
[]
["Soll","2020 Hilfsstoffe",null,null,null,null,null,null,null,"Haben"]
["Nr.","Kontenanruf",null,null,"Euro","Nr.","Kontenanruf",null,null,"Euro"]
["AB","8000",null,null,{"$f":"Bilanzbuch!C9","v":32500}]
[null,null,null,null,null,"SB",null,null,null,null,{"$f":"IF(L33=\"Kontenanrufe vollständig!\",1,2)","v":2},{"$f":"IF(AND(G32=6020,G33=8010),\"Kontenanrufe vollständig!\",\"Kontenanrufe nicht vollständig!\")","v":"Kontenanrufe nicht vollständig!"}]
[null,null,null,null,null,null,null,null,null,null,{"$f":"IF(L34=\"Saldo richtig!\",1,2)","v":2},{"$f":"IF(J33=32250,\"Saldo richtig!\",\"Ermitteln Sie den richtigen Saldo!\")","v":"Ermitteln Sie den richtigen Saldo!"}]
[]
["Soll","2030 Betriebsstoffe",null,null,null,null,null,null,null,"Haben"]
["Nr.","Kontenanruf",null,null,"Euro","Nr.","Kontenanruf",null,null,"Euro"]
["AB","8000",null,null,{"$f":"Bilanzbuch!C10","v":12500}]
[null,null,null,null,null,"SB",null,null,null,null,{"$f":"IF(L39=\"Kontenanrufe vollständig!\",1,2)","v":2},{"$f":"IF(AND(G38=6030,G39=8010),\"Kontenanrufe vollständig!\",\"Kontenanrufe nicht vollständig!\")","v":"Kontenanrufe nicht vollständig!"}]
[null,null,null,null,null,null,null,null,null,null,{"$f":"IF(L40=\"Saldo richtig!\",1,2)","v":2},{"$f":"IF(J39=12320,\"Saldo richtig!\",\"Ermitteln Sie den richtigen Saldo!\")","v":"Ermitteln Sie den richtigen Saldo!"}]
[]
["Soll","2100 Unfertige Erzeugnisse",null,null,null,null,null,null,null,"Haben","X"]
["Nr.","Kontenanruf",null,null,"Euro","Nr.","Kontenanruf",null,null,"Euro"]
["AB","8000",null,null,{"$f":"Bilanzbuch!C11","v":30200},"A1"]
[{"$f":"IF(E44<J44,\"A\",\"\")","v":""},{"$f":"IF(E44<J44,5200,\"\")","v":""},null,null,{"$f":"IF(E44<J44,E46-E44,\"\")","v":""},"A",null,null,null,null,{"$f":"IF(L45=\"Kontenanrufe vollständig!\",1,2)","v":2},{"$f":"IF(AND(G44=8010,G45=5200),\"Kontenanrufe vollständig!\",\"Kontenanrufe nicht vollständig!\")","v":"Kontenanrufe nicht vollständig!"}]
[null,null,null,null,null,null,null,null,null,null,{"$f":"IF(L46=\"Saldo richtig!\",1,2)","v":2},{"$f":"IF(J45=12000,\"Saldo richtig!\",\"Ermitteln Sie den richtigen Saldo!\")","v":"Ermitteln Sie den richtigen Saldo!"}]
[]
["Soll","2200 Fertige Erzeugnisse",null,null,null,null,null,null,null,"Haben"]
["Nr.","Kontenanruf",null,null,"Euro","Nr.","Kontenanruf",null,null,"Euro"]
["AB","8000",null,null,{"$f":"Bilanzbuch!C12","v":44000},"A1"]
[{"$f":"IF(E50<J50,\"A\",\"\")","v":""},null,null,null,null,null,null,null,null,null,{"$f":"IF(L51=\"Kontenanrufe vollständig!\",1,2)","v":2},{"$f":"IF(AND(G50=8010,B51=5200),\"Kontenanrufe vollständig!\",\"Kontenanrufe nicht vollständig!\")","v":"Kontenanrufe nicht vollständig!"}]
[null,null,null,null,null,null,null,null,null,null,{"$f":"IF(L52=\"Saldo richtig!\",1,2)","v":2},{"$f":"IF(E51=10900,\"Saldo richtig!\",\"Ermitteln Sie den richtigen Saldo!\")","v":"Ermitteln Sie den richtigen Saldo!"}]
[]
["Soll","2400 Forderungen aus Lieferungen und Leistungen",null,null,null,null,null,null,null,"Haben"]
["Nr.","Kontenanruf",null,null,"Euro","Nr.","Kontenanruf",null,null,"Euro"]
["AB","8000",null,null,{"$f":"Bilanzbuch!C13","v":55400}]
[null,null,null,null,null,"SB",null,null,null,null,{"$f":"IF(L57=\"Kontenanrufe vollständig!\",1,2)","v":2},{"$f":"IF(AND(B57=5000,C57=4800,G56=2800,G57=8010),\"Kontenanrufe vollständig!\",\"Kontenanrufe nicht vollständig!\")","v":"Kontenanrufe nicht vollständig!"}]
[null,null,null,null,null,null,null,null,null,null,{"$f":"IF(L58=\"Saldo richtig!\",1,2)","v":2},{"$f":"IF(J57=(E56+E57-J56),\"Saldo richtig!\",\"Ermitteln Sie den richtigen Saldo!\")","v":"Ermitteln Sie den richtigen Saldo!"}]
[]
["Soll","2600 Vorsteuer",null,null,null,null,null,null,null,"Haben"]
{"$rows_left_out":114}
{"sheet":"GuV","index":3,"n_rows":14,"n_cols":8,"rows_kept":14,"cut":false,"hidden":false,"merged":[[0,0,0,5],[2,1,2,4],[3,7,4,8],[3,6,4,6]]}
["Gewinn- und Verlustrechnung"]
[]
["Soll","8020 Gewinn und Verlust",null,null,null,"Haben"]
["5200","Bestandsveränderungen",null,"5000","Umsatzerlöse",null,{"$f":"IF(H4=\"Sie haben noch Fehler!\",2,1)","v":2},{"$f":"IF(C14=11625,\"Sie haben den Gewinn richtig ermittelt!\",\"Sie haben noch Fehler!\")","v":"Sie haben noch Fehler!"}]
["6000","Aufwendungen für Rohstoffe"]
["6020","Aufwendungen für Hilfsstoffe"]
["6030","Aufwendungen für Betriebsstoffe"]
["6160","Fremdinstandhaltung"]
["6200","Löhne"]
["6300","Gehälter"]
["8820","Portokosten"]
["7000","Betriebliche Steuern"]
["7510","Zinsaufwendungen"]
[3000,"Eigenkapital "]

{"sheet":"Bilanzbuch","index":4,"n_rows":31,"n_cols":8,"rows_kept":31,"cut":false,"hidden":false,"merged":[[2,1,2,4],[0,0,0,5],[17,1,17,4],[19,6,20,6]]}
["Bilanzbuch"]
[]
["Aktiva","8000 Eröffnungsbilanz",null,null,null,"Passiva"]
["0500","Grundstücke und Bauten",1250000,"3000","Eigenkapital",{"$f":"F16-SUM(F5:F15)","v":2292400}]
["0700","Technische Anlagen und Maschinen",520000,"4200","Verbindlichkeiten g. Kreditinstituten",92000]
["0800","Betriebs- und Geschäftsausstattung",84000,"4400","Verbindlichkeiten a.L.u.L.",45800]
["0840","Fuhrpark",95000,"4800","Umsatzsteuer",12200]
["2000","Rohstoffe",210000]
["2020","Hilfsstoffe",32500]
["2040","Betriebsstoffe",12500]
["2100","Unfertige Erzeugnisse",30200]
["2200","Fertige Erzeugnisse",44000]
["2400","Forderungen a.L.u.L.",55400]
["2800","Bank",98000]
["2880","Kasse",10800]
[null,null,{"$f":"SUM(C4:C15)","v":2442400},null,null,{"$f":"C16","v":2442400}]
[]
["Aktiva","8010 Schlussbilanz",null,null,null,"Passiva"]
["0500","Grundstücke und Bauten",null,"3000","Eigenkapital"]
["0700","Technische Anlagen und Maschinen",null,"4200","Verbindlichkeiten g. Kreditinstituten",null,{"$f":"IF(H20=\"Aktiva = Passiva\",1,2)","v":1},{"$f":"IF(C31-F31=0,\"Aktiva = Passiva\",IF(C31-F31>0,\"Aktiva > Passiva\",\"Aktiva < Passiva\"))","v":"Aktiva = Passiva"}]
["0800","Betriebs- und Geschäftsausstattung",null,"4400","Verbindlichkeiten a.L.u.L.",null,null,{"$f":"CONCATENATE(\"Differenz = \",$C$31-$F$31)","v":"Differenz = 0"}]
["0840","Fuhrpark",null,"4800","Umsatzsteuer"]
["2000","Rohstoffe"]
["2020","Hilfsstoffe"]
["2040","Betriebsstoffe"]
["2100","Unfertige Erzeugnisse"]
["2200","Fertige Erzeugnisse"]
["2400","Forderungen a.L.u.L."]
["2800","Bank"]
["2880","Kasse"]
[null,null,{"$f":"SUM(C19:C30)","v":0},null,null,{"$f":"SUM(F19:F30)","v":0}]

{"sheet":"Kontenplan","index":5,"n_rows":34,"n_cols":2,"rows_kept":34,"cut":false,"hidden":false,"merged":[]}
[null,"Kontenplan"]
[]
["Nr.","Konto"]
["0500","Grundstücke und Bauten"]
["0700","Technische Anlagen und Maschinen"]
["0800","Betriebs- und Geschäftsausstattung"]
["0840","Fuhrpark"]
["2000","Rohstoffe"]
["2020","Hilfsstoffe"]
["2030","Betriebsstoffe"]
["2100","Unfertige Erzeugnisse"]
["2200","Fertige Erzeugnisse"]
["2400","Forderungen a.L.u.L."]
["2600","Vorsteuer"]
["2800","Kreditinstitute/Bank"]
["2880","Kasse"]
["3000","Eigenkapital"]
["4200","Verbindlichkeiten g. Kreditinstituten"]
["4400","Verbindlichkeiten a.L.u.L."]
["4800","Umsatzsteuer"]
["5000","Umsatzerlöse"]
["5200","Bestandsveränderungen"]
["6000","Aufwendungen für Rohstoffe"]
["6020","Aufwendungen für Hilfsstoffe"]
["6030","Aufwendungen für Betriebsstoffe"]
["6160","Fremdinstandhaltung"]
["6200","Löhne"]
["6300","Gehälter"]
["6820","Portokosten"]
["7000","Betriebliche Steuern"]
["7510","Zinsaufwendungen"]
["8000","Eröffnungsbilanz"]
["8010","Schlussbilanz"]
["8020","Gewinn und Verlust"]